{"text_format":"1","workbook":"xlsx","n_sheets":6,"sheets":["Vejledning til Risikovurdering","Risikovurdering","Opgaveliste","Konsekvensanalyse","Trusselskatalog","Arbejdsark med formler "],"not_rendered":{"charts":0,"images":1,"macros":1,"external_links":0,"defined_names":2,"comments":1,"pivot_tables":0},"unopened":[],"bounds":{"document_bytes":16777216,"sheet_cells":100000,"rows_first":2000,"rows_last":500,"rows_between":2000,"halvings":0,"cell_chars":16384,"cell_head_chars":4096},"cells_cut":0,"cells_raw":0,"read":"whole","date_system":"1900"}

{"sheet":"Vejledning til Risikovurdering","index":0,"n_rows":66,"n_cols":7,"rows_kept":66,"cut":false,"hidden":false,"merged":[[24,0,24,3],[25,0,25,3],[6,0,6,5],[7,0,7,5],[9,0,9,3],[18,0,18,3],[19,0,19,3],[20,0,20,3],[11,2,11,3],[17,0,17,3],[21,0,21,3],[22,0,22,3],[23,0,23,3],[10,2,10,3],[12,2,12,3],[13,2,13,3],[46,0,46,1],[30,0,30,3],[31,0,31,3],[32,0,32,3],[26,0,26,3],[27,0,27,3],[28,0,28,3],[29,0,29,3],[47,0,47,1],[48,0,48,1],[49,0,49,1],[50,0,50,1],[51,0,51,1],[14,2,14,3],[0,0,0,5],[3,0,3,5],[4,0,4,5],[5,0,5,5],[1,0,1,5],[60,0,60,5],[37,0,37,5],[16,0,16,3],[38,2,38,5],[39,2,39,5],[40,2,40,5],[41,2,41,5],[42,2,42,5],[44,0,44,5],[58,0,58,5],[54,2,54,6],[55,2,55,6],[35,0,35,5],[34,0,34,5],[53,2,53,6],[52,2,52,6],[61,3,61,6],[62,3,62,6],[63,3,63,6],[64,3,64,6],[65,3,65,6],[61,0,61,2],[62,0,62,2],[63,0,63,2],[64,0,64,2],[65,0,65,2]]}
["Læsevejledning til udfyldelse af risikovurderingen "]
["Dokumentet består af flere faner; de blå faner giver information og vejledning, mens de grønne faner er dem, du skal udfylde. \n\nDen vigtigste fane er 'Risikovurdering', hvor du udfylder selve risikovurderingen. Du skal udfylde de felter, som er markeret med rød tekst.\n\nDet første, du skal udfylde i risikovurderingen, er stamdata for systemet.\n\nDernæst skal du forholde dig til de tolv beskrevne trusler. Der er tilføjet tomme felter, så du har mulighed for selv at tilføje flere trusler. I arket 'Trusselskatalog' kan du få inspiration til flere trusler og få viden om, hvilke scenarier der ligger bag de tolv beskrevne trusler.  \n\nI risikovurderingen skal du forholde dig til én trussel ad gangen, hvor du hertil vurderer sandsynlighed for, at en given trussel rammer systemet. Efter du har vurderet sandsynlighed, skal du begrunde dit valg og forklare, hvordan du har fundet frem til vurderingen. \n\nDit næste skridt er at vurdere konsekvens for Jammerbugt Kommune som arbejdsplads, hvis der sker et brud på fortrolighed, integritet eller tilgængelighed. Her skal du også begrunde dit valg af konsekvens og forklare med dine egne ord, hvad truslen vil medføre af konsekvens for kommunen. Det samme skal du gøre, når du skal vurdere konsekvens for den registrerede (det kan fx borger eller medarbejder). \n\nDu skal nu vurdere, hvorvidt en konsekvensanalyse skal udarbejdes. Det gøres i arket 'Konsekvensanalyse', hvor du finder to bokse, som begge skal udfyldes. Længst til højre i boksen ved 'Vælg' skal du besvare det pågældende spørgsmål ved at vælge enten 'Ja' eller 'Nej'. Den første boks indeholder to spørgsmål, og hvis bare én af spørgsmålene besvares med et 'Ja', skal der udarbejdes en konsekvensanalyse. I boks nr. 2 finder du seks spørgsmål, hvor hvis én eller flere af disse spørgsmål bliver et 'Ja', skal du tage kontakt til kommunens sikkerhedsrådgiver på sikkerhed@jammerbugt.dk, så I kan lave en fælles vurdering af, om en konsekvensanalyse skal udarbejdes. Hvis beslutningen bliver, at en konsekvensanalyse ikke skal udarbejdes, skal du i den tredje og sidste boks i arket 'Konsekvensanalyse' skrive med egne ord, hvad der ligger til grund for fravalg af en konsekvensanalyse. \n\nEfterhånden, som skemaet udfyldes, vil risikoen for hhv. kommunen og for den registrerede (risikovægtning) skifte farve. Øverst i risikovurderingen ses en farvebeskrivelse af, hvor alvorlig risikoen er. Hvis risikoen ender med at blive 'gul' eller 'rød' vil truslen automatisk blive ført over i fanen 'Opgaveliste'. I ’Opgaveliste’ skal du notere, hvad du vil gøre for at nedbringe risikoen, herunder hvem der er ansvarlig for opgaven og hvornår opgaven vil være udført. Når opgaver tilknyttet en risiko er afsluttet, genvurderes risikoniveauet.\n\nVær opmærksom på, at du ikke må slette rækker i Excel-arket.\n\nArket 'Arbejdsark med formler' er udelukkende et arbejdsark - det har ingen betydning for udfyldelsen af risikovurderingen."]
[]
["Begrebsforklaring og metodebeskrivelse til risikovurdering "]
["En risikovurdering består af en konsekvensvurdering og en sårbarhedsvurdering \n\nKonsekvensvurderingen beskriver konsekvensen for den registrerede, hvis der sker et brud på fortrolighed, integritet eller tilgængelighed. Sårbarhedsvurderingen vurderer sandsynligheden for, at en trussel rammer systemet og udnytter en sårbarhed. "]
[]
["Konsekvensvurdering "]
["It-løsningen er konsekvensvurderet i forhold til fortrolighed, tilgængelighed og integritet. Konsekvensen er for den registreredes rettigheder hvis: \n•              Data ikke er tilgængelig i flere dage (tilgængelighed)\n•              Uvedkommende får fat i oplysningerne (fortrolighed)\n•              Data er forkerte (integritet)\n\nI nedenstående skema finder du en beskrivelse af konsekvensvurderingen 1, 2, 3 og 4 og betydningen heraf. Der er også en beskrivelse af, hvad der menes med fortrolighed, tilgængelighed og integritet.\n\nKonsekvensvurderingen er bygget således op, at det højeste tal 'vinder'. Dette vil sige, at hvis konsekvensen er vurderet til at være 4 i spørgsmålet om fortrolighed, men 'kun' er 2 eller 3 i de øvrige spørgsmål, er det den samlede konsekvensvurdering, der 'vinder' altså 4. "]
[]
["Beskrivelse af konsekvens "]
{"$rows_left_out":57}
{"sheet":"Risikovurdering","index":1,"n_rows":25,"n_cols":24,"rows_kept":25,"cut":false,"hidden":false,"merged":[[4,21,5,21],[4,4,5,4],[4,9,4,13],[4,16,4,20],[4,14,5,14],[23,1,24,2],[5,1,5,2],[4,7,5,7],[4,5,4,6],[4,1,4,2]]}
[]
[null,"Risikovurdering af system, proces mv. i Jammerbugt Kommune"]
[]
[]
[null,"<Systemnavn eller procesnavn>",null,null,"Trusler","Vurdering af sandsynlighed",null,"Begrundelse for vurderingen af sandsynlighed",null,"Konsekvens for Jammerbugt Kommune \n\nTip: Kan kommunen levere sine ydelser på tilfredsstillende vis?",null,null,null,null,"Begrundelse for vurderingen af konsekvens",null,"Konsekvens for \nden registrerede fx borger eller medarbejder",null,null,null,null,"Begrundelse for vurderingen af konsekvens"]
[null,"Generelle oplysninger om databehandlingen",null,null,null,"Sandsynlighed ","Risikoscore",null,null,"Konsekvens","Risikoscore","Konsekvenstype\n","Risikoscore","Risikovægtning ",null,null,"Konsekvens","Risikoscore","Konsekvenstype","Risikoscore","Risikovægtning"]
[null,"Kategori\n(Vælg fra dropdown-menu)","Vælg kategori",null,"Manglende adgangsstyring og kontrol af brugere","Vælg sandsynlighed",{"$f":"_xlfn.IFS(F7=\"Vælg sandsynlighed\",\"0\",F7=\"Ikke relevant\",\"0\",F7=\"Usandsynligt\",\"1\",F7=\"Mindre sandsynligt\",\"2\",F7=\"Sandsynligt\",\"3\",F7=\"Forventet\",\"4\")","v":"0"},"<Begrundelse>",null,"Vælg konsekvens",{"$f":"_xlfn.IFS(J7=\"Vælg konsekvens\",\"0\",J7=\"Ikke relevant\",\"0\",J7=\"Lav\",\"1\",J7=\"Medium\",\"2\",J7=\"Høj\",\"3\",J7=\"Meget høj\",\"4\")","v":"0"},"Brud på fortrolighed Brud på integritet ",{"$f":"G7*K7","v":0},null,"<Begrundelse>",null,"Vælg konsekvens",{"$f":"_xlfn.IFS(Q7=\"Vælg konsekvens\",\"0\",Q7=\"Ikke relevant\",\"0\",Q7=\"Lav\",\"1\",Q7=\"Medium\",\"2\",Q7=\"Høj\",\"3\",Q7=\"Meget høj\",\"4\")","v":"0"},"Brud på fortrolighed Brud på integritet ",{"$f":"G7*R7","v":0},null,"<Begrundelse>",{"$f":"IF(T7>=7,1,0)","v":0},{"$f":"IF(W7=1,1,0)","v":0}]
[null,"Leverandør","<Leverandørnavn>",null,"Manglende beskyttelse af data ved forsendelse som fx lav eller ingen kryptering","Vælg sandsynlighed",{"$f":"_xlfn.IFS(F8=\"Vælg sandsynlighed\",\"0\",F8=\"Ikke relevant\",\"0\",F8=\"Usandsynligt\",\"1\",F8=\"Mindre sandsynligt\",\"2\",F8=\"Sandsynligt\",\"3\",F8=\"Forventet\",\"4\")","v":"0"},"<Begrundelse>",null,"Vælg konsekvens",{"$f":"_xlfn.IFS(J8=\"Vælg konsekvens\",\"0\",J8=\"Ikke relevant\",\"0\",J8=\"Lav\",\"1\",J8=\"Medium\",\"2\",J8=\"Høj\",\"3\",J8=\"Meget høj\",\"4\")","v":"0"},"Brud på fortrolighed ",{"$f":"G8*K8","v":0},null,"<Begrundelse>",null,"Vælg konsekvens",{"$f":"_xlfn.IFS(Q8=\"Vælg konsekvens\",\"0\",Q8=\"Ikke relevant\",\"0\",Q8=\"Lav\",\"1\",Q8=\"Medium\",\"2\",Q8=\"Høj\",\"3\",Q8=\"Meget høj\",\"4\")","v":"0"},"Brud på fortrolighed ",0,null,"<Begrundelse>",{"$f":"IF(T8>=7,1,0)","v":0},{"$f":"IF(W8=1,W7+1,0)","v":0}]
[null,"Forvaltning\n(Vælg fra dropdown-menu)","Vælg forvaltning",null,"Problemer i forbindelse med udlicitering som fx, at leverandør går konkurs, eller at samarbejdet brat ophører","Vælg sandsynlighed",{"$f":"_xlfn.IFS(F9=\"Vælg sandsynlighed\",\"0\",F9=\"Ikke relevant\",\"0\",F9=\"Usandsynligt\",\"1\",F9=\"Mindre sandsynligt\",\"2\",F9=\"Sandsynligt\",\"3\",F9=\"Forventet\",\"4\")","v":"0"},"<Begrundelse>",null,"Vælg konsekvens",{"$f":"_xlfn.IFS(J9=\"Vælg konsekvens\",\"0\",J9=\"Ikke relevant\",\"0\",J9=\"Lav\",\"1\",J9=\"Medium\",\"2\",J9=\"Høj\",\"3\",J9=\"Meget høj\",\"4\")","v":"0"},"Brud på tilgængelighed ",0,null,"<Begrundelse>",null,"Vælg konsekvens","0","Brud på tilgængelighed ",0,null,"<Begrundelse>",0,{"$f":"IF(W9=1,W7+W8+1,0)","v":0}]
[null,"Afdelingsnavn"," <Fx Skole og Dagtilbud>",null,"Ubevidste brugerfejl som fx tab af it-udstyr, forlæggelse af print eller videregivelse af personoplysninger ved en fejl (bruger handler uagtsomt)","Vælg sandsynlighed","0","<Begrundelse>",null,"Vælg konsekvens","0","Brud på integritet Brud på fortrolighed ",0,null,"<Begrundelse>",null,"Vælg konsekvens","0","Brud på integritet Brud på fortrolighed ",0,null,"<Begrundelse>",0,{"$f":"IF(W10=1,W7+W8+W9+1,0)","v":0}]
{"$rows_left_out":16}
{"sheet":"Opgaveliste","index":2,"n_rows":19,"n_cols":32,"rows_kept":19,"cut":false,"hidden":false,"merged":[[4,1,4,2],[5,1,5,2]]}
[]
[null,"Opgaveliste afledt af udarbejdet risikovurdering"]
[]
[]
[null,"Systemets navn:",null,null,"Vurdering af relevante risici"]
[null,{"$f":"Risikovurdering!B5","v":"<Systemnavn eller procesnavn>"}]
[null,"Systemet",null,null,"Observation Nr. 1",null,"Observation Nr. 2",null,"Observation Nr. 3",null,"Observation Nr. 4",null,"Observation Nr. 5",null,"Observation Nr. 6",null,"Observation Nr. 7",null,"Observation Nr. 8",null,"Observation Nr. 9",null,"Observation Nr. 10",null,"Observation Nr. 11",null,"Observation Nr. 12","Observation Nr. 13","Observation Nr. 14","Observation Nr. 15","Observation Nr. 16","Observation Nr. 17"]
[null,"Dato for udarbejdelsen af risikovurderingen:",{"$f":"Risikovurdering!C21","v":"<dd-mm-åååå>"},null,{"$f":"_xlfn.XLOOKUP(1,Risikovurdering!X7:X25,Risikovurdering!T7:T25,\"-\")","v":"-"},null,{"$f":"_xlfn.XLOOKUP(2,Risikovurdering!X7:X25,Risikovurdering!T7:T25,\"-\")","v":"-"},null,{"$f":"_xlfn.XLOOKUP(3,Risikovurdering!X7:X25,Risikovurdering!T7:T25,\"-\")","v":"-"},null,{"$f":"_xlfn.XLOOKUP(4,Risikovurdering!X7:X25,Risikovurdering!T7:T25,\"-\")","v":"-"},null,{"$f":"_xlfn.XLOOKUP(5,Risikovurdering!X7:X25,Risikovurdering!T7:T25,\"-\")","v":"-"},null,{"$f":"_xlfn.XLOOKUP(6,Risikovurdering!X7:X25,Risikovurdering!T7:T25,\"-\")","v":"-"},null,{"$f":"_xlfn.XLOOKUP(7,Risikovurdering!X7:X25,Risikovurdering!T7:T25,\"-\")","v":"-"},null,{"$f":"_xlfn.XLOOKUP(8,Risikovurdering!X7:X25,Risikovurdering!T7:T25,\"-\")","v":"-"},null,{"$f":"_xlfn.XLOOKUP(9,Risikovurdering!X7:X25,Risikovurdering!T7:T25,\"-\")","v":"-"},null,{"$f":"_xlfn.XLOOKUP(10,Risikovurdering!X7:X25,Risikovurdering!T7:T25,\"-\")","v":"-"},null,{"$f":"_xlfn.XLOOKUP(11,Risikovurdering!X7:X25,Risikovurdering!T7:T25,\"-\")","v":"-"},null,{"$f":"_xlfn.XLOOKUP(12,Risikovurdering!X7:X25,Risikovurdering!T7:T25,\"-\")","v":"-"},{"$f":"_xlfn.XLOOKUP(13,Risikovurdering!X7:X25,Risikovurdering!T7:T25,\"-\")","v":"-"},{"$f":"_xlfn.XLOOKUP(14,Risikovurdering!X7:X25,Risikovurdering!T7:T25,\"-\")","v":"-"},{"$f":"_xlfn.XLOOKUP(15,Risikovurdering!X7:X25,Risikovurdering!T7:T25,\"-\")","v":"-"},{"$f":"_xlfn.XLOOKUP(16,Risikovurdering!X7:X25,Risikovurdering!T7:T25,\"-\")","v":"-"},{"$f":"_xlfn.XLOOKUP(17,Risikovurdering!X7:X25,Risikovurdering!T7:T25,\"-\")","v":"-"}]
[null,"Systemejer:",{"$f":"Risikovurdering!C12","v":"<Navn>"},null,{"$f":"_xlfn.XLOOKUP(1,Risikovurdering!X7:X25,Risikovurdering!E7:E25,\"-\")","v":"-"},null,{"$f":"_xlfn.XLOOKUP(2,Risikovurdering!X7:X25,Risikovurdering!E7:E25,\"-\")","v":"-"},null,{"$f":"_xlfn.XLOOKUP(3,Risikovurdering!X7:X25,Risikovurdering!E7:E25,\"-\")","v":"-"},null,{"$f":"_xlfn.XLOOKUP(4,Risikovurdering!X7:X25,Risikovurdering!E7:E25,\"-\")","v":"-"},null,{"$f":"_xlfn.XLOOKUP(5,Risikovurdering!X7:X25,Risikovurdering!E7:E25,\"-\")","v":"-"},null,{"$f":"_xlfn.XLOOKUP(6,Risikovurdering!X7:X25,Risikovurdering!E7:E25,\"-\")","v":"-"},null,{"$f":"_xlfn.XLOOKUP(7,Risikovurdering!X7:X25,Risikovurdering!E7:E25,\"-\")","v":"-"},null,{"$f":"_xlfn.XLOOKUP(8,Risikovurdering!X7:X25,Risikovurdering!E7:E25,\"-\")","v":"-"},null,{"$f":"_xlfn.XLOOKUP(9,Risikovurdering!X7:X25,Risikovurdering!E7:E25,\"-\")","v":"-"},null,{"$f":"_xlfn.XLOOKUP(10,Risikovurdering!X7:X25,Risikovurdering!E7:E25,\"-\")","v":"-"},null,{"$f":"_xlfn.XLOOKUP(11,Risikovurdering!X7:X25,Risikovurdering!E7:E25,\"-\")","v":"-"},null,{"$f":"_xlfn.XLOOKUP(12,Risikovurdering!X7:X25,Risikovurdering!E7:E25,\"-\")","v":"-"},{"$f":"_xlfn.XLOOKUP(13,Risikovurdering!X7:X25,Risikovurdering!E7:E25,\"-\")","v":"-"},{"$f":"_xlfn.XLOOKUP(14,Risikovurdering!X7:X25,Risikovurdering!E7:E25,\"-\")","v":"-"},{"$f":"_xlfn.XLOOKUP(15,Risikovurdering!X7:X25,Risikovurdering!E7:E25,\"-\")","v":"-"},{"$f":"_xlfn.XLOOKUP(16,Risikovurdering!X7:X25,Risikovurdering!E7:E25,\"-\")","v":"-"},{"$f":"_xlfn.XLOOKUP(17,Risikovurdering!X7:X25,Risikovurdering!E7:E25,\"-\")","v":"-"}]
[null,"Systemforvalter:",{"$f":"Risikovurdering!C13","v":"<Navn>"},null,"Forklaring",null,"Forklaring",null,"Forklaring ",null,"Forklaring",null,"Forklaring",null,"Forklaring",null,"Forklaring",null,"Forklaring",null,"Forklaring",null,"Forklaring",null,"Forklaring",null,"Forklaring","Forklaring","Forklaring","Forklaring","Forklaring","Forklaring"]
{"$rows_left_out":10}
{"sheet":"Konsekvensanalyse","index":3,"n_rows":18,"n_cols":12,"rows_kept":18,"cut":false,"hidden":false,"merged":[[0,0,0,1],[7,1,7,8],[8,1,8,8],[9,1,9,8],[2,0,2,8],[6,1,6,8],[4,1,4,8],[5,1,5,8],[3,0,3,8],[12,1,12,8],[2,11,4,20],[17,0,17,9],[18,0,18,9],[11,1,11,8],[2,9,3,9],[14,0,14,8],[10,1,10,8],[13,1,13,8]]}
["Vurdering af behov for konsekvensanalyse "]
[]
["1. Vurdering af, om der skal udarbejdes en konsekvensanalyse",null,null,null,null,null,null,null,null,null,null,"Hvis der er behov for at udarbejde en konsekvensanalyse, skal du kontakte kommunens sikkerhedsrådgiver på sikkerhed@jammerbugt.dk. Sikkerhedsrådgiveren vil herefter hjælpe dig videre i processen."]
["Udfyld nedenstående spørgsmål. \nHvis bare ét af de to nedenstående vurderingskriterier er et 'Ja', SKAL du kontakte kommunens sikkerhedsrådgiver på sikkerhed@jammerbugt.dk for sparring om, hvorvidt der skal udarbejdes en konsekvensanalyse. "]
[1,"Sker der i systemet automatiske afgørelser, herunder profilering? Det vil sige behandlinger, der fører til afgørelser om en fysisk persons rettigheder til et produkt, en service, en potentiel mulighed eller begunstigelse, der er baseret på en hvilken som helst form for automatiseret afgørelse (herunder profilering).",null,null,null,null,null,null,null,"Vælg "]
[2,"Behandles der profilering af fysiske personer i stor skala (anvendelse af personoplysninger til at evaluere bestemte personlige forhold)? Stor skala defineres som værende: 1) Behandling af over 500 registreredes oplysninger, 2) mængden af data og/eller forskellige data, der behandles, 3) databehandlingens varighed eller regelmæssighed, og 4) databehandlingens georgrafiske omfang",null,null,null,null,null,null,null,"Vælg "]
[3,"Behandles data ved brug af nye teknologier? Nye teknologier defineres som værende fx cloud-services, applikationer med borgerkontakt, kunstig intelligens, brug af elektroniske identiteter ",null,null,null,null,null,null,null,"Vælg "]
[4,"Behandles der biometriske data for at kunne identificere en fysisk person? Eks. fingeraftryk, ansigtstræk, stemme og iris.  ",null,null,null,null,null,null,null,"Vælg "]
[5,"Behandles der genetiske data? Eks. blod- og/eller vævsprøver. ",null,null,null,null,null,null,null,"Vælg "]
[6,"Behandles der lokationsdata, hvor en fysisk person befinder sig? ",null,null,null,null,null,null,null,"Vælg "]
{"$rows_left_out":9}
{"sheet":"Trusselskatalog","index":4,"n_rows":82,"n_cols":3,"rows_kept":82,"cut":false,"hidden":false,"merged":[[68,0,71,0],[68,1,71,1],[72,0,76,0],[72,1,76,1],[77,0,81,0],[77,1,81,1],[1,0,13,0],[1,1,13,1],[14,1,15,1],[16,1,19,1],[20,1,24,1],[14,0,15,0],[20,0,24,0],[16,0,19,0],[25,1,28,1],[63,0,67,0],[56,0,62,0],[50,0,55,0],[47,0,48,0],[38,0,43,0],[29,0,37,0],[29,1,37,1],[38,1,43,1],[47,1,48,1],[50,1,55,1],[56,1,62,1],[63,1,67,1],[25,0,28,0],[44,0,46,0],[44,1,46,1]]}
["Nummer ","Trussel ","Underliggende trusler "]
[1,"Manglende adgangsstyring og kontrol af brugere","Systemet er svært af drifte og udvikle pga. mangelfuld ansvarsfordeling."]
[null,null,"Medarbejdere anvender private tjenester privat mail, Dropbox, ect.) til at opbebare og arbejde med data på. "]
[null,null,"Medarbejdere deler fortrolige data eller personoplysninger med eksterne interessenter via almindelig mail (ikke-sikker mail uden brug af passende kryptering)."]
[null,null,"Medarbejdere får adgang til informationer, som de ikke bør have adgang til. "]
[null,null,"Medarbejdere gemmer fortrolige informationer på fil-drev, hvor sikkerhedsniveauet er lavere end i selve systemet/applikationen, hvorved informationerne bliver kompromitteret, da de kommer til andres kendskab. "]
[null,null,"Medarbejdere har for mange rettigheder til forretningssystemet f.eks. grundet manglende kontrol med rettigheder."]
[null,null,"For mange medarbejdere har superbruger-/administrativerettigheder til forretningssystemet, f.eks. grundet mangelfulde muligheder for rettighedsstyring. "]
[null,null,"Fratrådte medarbejderes adgang fjernes ikke og vil derved kunne bruges til at kompromittere aktivet/systemet."]
[null,null,"Systemadministratorer har for mange rettigheder, f.eks. grundet utilstrækkeligt rettighedssetup eller manglende kontrol med rettigheder."]
{"$rows_left_out":73}
{"sheet":"Arbejdsark med formler ","index":5,"n_rows":152,"n_cols":16,"rows_kept":152,"cut":false,"hidden":false,"merged":[]}
[]
[]
[null,"Sandsynlighed","Vægtning"]
[null,"Vælg sandsynlighed",null,null,null,0,0,{"$f":"F4*G4","v":0}]
[null,"Ikke relevant",0,null,null,0,1,{"$f":"F5*G5","v":0}]
[null,"Usandsynligt",1,null,null,0,2,0]
[null,"Mindre sandsynligt",2,null,null,0,3,0]
[null,"Sandsynligt",3,null,null,0,4,0]
[null,"Forventet",4,null,null,1,1,1]
[null,null,null,null,null,1,2,2]
{"$rows_left_out":142}